Reaction Details
TargetAdenosine receptor A2a
LigandBDBM50201017
Substrate/Competitorn/a
Meas. Tech.ChEMBL_1622887 (CHEMBL3865239)
Ki 0.500000±n/a nM
Citation Rosse, G Quinazoline Carboxamides as Selective Antagonists of Adenosine 2A Receptor. ACS Med Chem Lett7:1014-1015 (2016) 
 
Adenosine receptor A2a
Name:Adenosine receptor A2a
Type:G Protein-Coupled Receptor (GPCR)
Mol. Mass.:44716.46
Organism:Homo sapiens (Human)
Description:P29274
Residue:412
BDBM50201017
NameBDBM50201017
Synonyms:CHEMBL3941632 | US10138212, Example 15
TypeSmall organic molecule
Emp. Form.C17H17N5O2
Mol. Mass.323.3492
SMILESCOc1cccc2c(nc(N)nc12)C(=O)NCc1cccc(C)n1