Reaction Details
TargetRAF proto-oncogene serine/threonine-protein kinase
LigandBDBM50201030
Substrate/Competitorn/a
Meas. Tech.ChEMBL_1622892 (CHEMBL3865244)
IC50 0.100000±n/a nM
Citation Rosse, G Pyridyl Isonicotinamide Inhibitors of RAF Kinase. ACS Med Chem Lett7:1022-1023 (2016) 
 
RAF proto-oncogene serine/threonine-protein kinase
Name:RAF proto-oncogene serine/threonine-protein kinase
Type:Serine/threonine-protein kinase
Mol. Mass.:73082.52
Organism:Homo sapiens (Human)
Description:P04049
Residue:648
BDBM50201030
NameBDBM50201030
Synonyms:CHEMBL3929689
TypeSmall organic molecule
Emp. Form.C25H26F3N4O7P
Mol. Mass.582.4655
SMILESCc1ccc(NC(=O)c2ccnc(c2)C(F)(F)F)cc1-c1cc(OCCOP(O)(O)=O)nc(c1)N1CCOCC1