Reaction Details
TargetRAF proto-oncogene serine/threonine-protein kinase
LigandBDBM50201034
Substrate/Competitorn/a
Meas. Tech.ChEMBL_1622892 (CHEMBL3865244)
IC50 0.100000±n/a nM
Citation Rosse, G Pyridyl Isonicotinamide Inhibitors of RAF Kinase. ACS Med Chem Lett7:1022-1023 (2016) 
 
RAF proto-oncogene serine/threonine-protein kinase
Name:RAF proto-oncogene serine/threonine-protein kinase
Type:Serine/threonine-protein kinase
Mol. Mass.:73082.52
Organism:Homo sapiens (Human)
Description:P04049
Residue:648
BDBM50201034
NameBDBM50201034
Synonyms:CHEMBL3952506
TypeSmall organic molecule
Emp. Form.C27H31F2N4O7P
Mol. Mass.592.5282
SMILESC[C@@H]1COCCN1c1cc(cc(OCCOP(O)(O)=O)n1)-c1cc(NC(=O)c2ccnc(c2)C(C)(F)F)ccc1C