Reaction Details
TargetCruzipain
LigandBDBM50201213
Substrate/Competitorn/a
Meas. Tech.ChEMBL_1623049 (CHEMBL3865401)
Ki 16±n/a nM
Citation Latorre, ASchirmeister, TKesselring, JJung, SJohé, PHellmich, UAHeilos, AEngels, BKrauth-Siegel, RLDirdjaja, NBou-Iserte, LRodríguez, SGonzález, FV Dipeptidyl Nitroalkenes as Potent Reversible Inhibitors of Cysteine Proteases Rhodesain and Cruzain. ACS Med Chem Lett7:1073-1076 (2016) 
 
Cruzipain
Name:Cruzipain
Type:Protein
Mol. Mass.:49831.41
Organism:Trypanosoma cruzi
Description:P25779
Residue:467
BDBM50201213
NameBDBM50201213
Synonyms:CHEMBL3934979
TypeSmall organic molecule
Emp. Form.C24H29N3O5
Mol. Mass.439.5042
SMILESCC(C)C[C@H](NC(=O)[C@H](Cc1ccccc1)NC(=O)OCc1ccccc1)\C=C\[N+]([O-])=O