Reaction Details
TargetComplement factor D
LigandBDBM50201564
Substrate/Competitorn/a
Meas. Tech.ChEMBL_1623115 (CHEMBL3865467)
IC50 205±n/a nM
Citation Yang, CYPhillips, JGStuckey, JABai, LSun, HDelproposto, JBrown, WCChinnaswamy, K Buried Hydrogen Bond Interactions Contribute to the High Potency of Complement Factor D Inhibitors. ACS Med Chem Lett7:1092-1096 (2016) 
 
Complement factor D
Name:Complement factor D
Type:Protein
Mol. Mass.:27039.19
Organism:Homo sapiens (Human)
Description:P00746
Residue:253
BDBM50201564
NameBDBM50201564
Synonyms:CHEMBL3890777
TypeSmall organic molecule
Emp. Form.C18H16BrN7O3S
Mol. Mass.490.334
SMILESNC(=O)c1nn(CC(=O)N2CCS[C@H]2C(=O)Nc2cccc(Br)n2)c2ncccc12