Reaction Details
TargetDihydroorotate dehydrogenase (quinone), mitochondrial
LigandBDBM85507
Substrate/Competitorn/a
Meas. Tech.ChEMBL_1623169 (CHEMBL3865521)
IC50 17000±n/a nM
Citation Lewis, TASykes, DBLaw, JMMuņoz, BRustiguel, JKNonato, MCScadden, DTSchreiber, SL Development of ML390: A Human DHODH Inhibitor That Induces Differentiation in Acute Myeloid Leukemia. ACS Med Chem Lett7:1112-1117 (2016) 
 
Dihydroorotate dehydrogenase (quinone), mitochondrial
Name:Dihydroorotate dehydrogenase (quinone), mitochondrial
Type:Enzyme
Mol. Mass.:42881.33
Organism:Homo sapiens (Human)
Description:Q02127
Residue:395
BDBM85507
NameBDBM85507
Synonyms:CAS_4394-00-7 Niflumic acid US10278929, Niflumic acid US20240002326, Compound Niflumic acid
TypeSmall organic molecule
Emp. Form.C13H9F3N2O2
Mol. Mass.282.218
SMILESOC(=O)c1cccnc1Nc1cccc(c1)C(F)(F)F