Reaction Details
TargetApoptosis regulator Bcl-2
LigandBDBM50162774
Substrate/Competitorn/a
Meas. Tech.ChEMBL_1623373 (CHEMBL3865725)
Ki<1.000000±n/a nM
Citation Lu, YWu, SYue, YHe, SLi, JTang, JWang, WZhou, HB Gossypol with Hydrophobic Linear Esters Exhibits Enhanced Antitumor Activity as an Inhibitor of Antiapoptotic Proteins. ACS Med Chem Lett7:1185-1190 (2016) 
 
Apoptosis regulator Bcl-2
Name:Apoptosis regulator Bcl-2
Type:Homodimer or heterodimer
Mol. Mass.:26269.11
Organism:Homo sapiens (Human)
Description:P10415
Residue:239
BDBM50162774
NameBDBM50162774
Synonyms:ABT-199 Venetoclax
TypeSmall organic molecule
Emp. Form.C45H50ClN7O7S
Mol. Mass.868.439
SMILESCC1(C)CCC(CN2CCN(CC2)c2ccc(C(=O)NS(=O)(=O)c3ccc(NCC4CCOCC4)c(c3)N(=O)=O)c(Oc3cnc4[nH]ccc4c3)c2)=C(C1)c1ccc(Cl)cc1