Reaction Details
TargetCyclin-A2/Cyclin-dependent kinase 1
LigandBDBM50202432
Substrate/Competitorn/a
Meas. Tech.ChEMBL_1624047 (CHEMBL3866459)
IC50 2.8±n/a nM
Citation Ibrahim, HSAbou-Seri, SMAbdel-Aziz, HA 3-Hydrazinoindolin-2-one derivatives: Chemical classification and investigation of their targets as anticancer agents. Eur J Med Chem122:366-381 (2016) 
 
Cyclin-A2/Cyclin-dependent kinase 1
Name:Cyclin-A2/Cyclin-dependent kinase 1
Type:Protein Complex
Mol. Mass.:n/a
Description:CDK1 was expressed in a baculovirus expression system and was partially purified. Cyclin A was purified separately and mixed with CDK1 before assays.
Components:This complex has 2 components.
Component 1
Name:Cyclin-dependent kinase 1
Synonyms:CDC2 CDK1 CDKN1 Cell division protein kinase 1 P34CDC2 | p34 protein kinase
Type:Enzyme Subunit
Mol. Mass.:34101.08
Organism:Homo sapiens (Human)
Description:P06493
Residue:297
Component 2
Name:Cyclin-A2
Synonyms:CCN1 CCNA1 CCNA2_HUMAN Cyclin-A
Type:Enzyme Subunit
Mol. Mass.:48550.19
Organism:Homo sapiens (Human)
Description:P20248
Residue:432
BDBM50202432
NameBDBM50202432
Synonyms:CHEMBL410883
TypeSmall organic molecule
Emp. Form.C15H13N5O4S
Mol. Mass.359.36
SMILESNC(=O)c1ccc2NC(=O)\C(=N/Nc3ccc(cc3)S(N)(=O)=O)c2c1