Reaction Details
TargetATP-binding cassette sub-family C member 2
LigandBDBM50202449
Substrate/Competitorn/a
Meas. Tech.ChEBML_1624157
IC50 14400±n/a nM
Citation Baiceanu, ENguyen, KAGonzalez-Lobato, LNasr, RBaubichon-Cortay, HLoghin, FLe Borgne, MChow, LBoumendjel, APeuchmaur, MFalson, P 2-Indolylmethylenebenzofuranones as first effective inhibitors of ABCC2. Eur J Med Chem122:408-418 (2016) 
 
ATP-binding cassette sub-family C member 2
Name:ATP-binding cassette sub-family C member 2
Type:Protein
Mol. Mass.:174229.45
Organism:Homo sapiens (Human)
Description:Q92887
Residue:1545
BDBM50202449
NameBDBM50202449
Synonyms:CHEMBL3263910
TypeSmall organic molecule
Emp. Form.C24H16BrNO4
Mol. Mass.462.292
SMILESOc1cc2O\C(=C/c3cn(Cc4cccc(Br)c4)c4ccccc34)C(=O)c2c(O)c1