Reaction Details
TargetATP-binding cassette sub-family C member 2
LigandBDBM50202451
Substrate/Competitorn/a
Meas. Tech.ChEBML_1624157
IC50 8200±n/a nM
Citation Baiceanu, ENguyen, KAGonzalez-Lobato, LNasr, RBaubichon-Cortay, HLoghin, FLe Borgne, MChow, LBoumendjel, APeuchmaur, MFalson, P 2-Indolylmethylenebenzofuranones as first effective inhibitors of ABCC2. Eur J Med Chem122:408-418 (2016) 
 
ATP-binding cassette sub-family C member 2
Name:ATP-binding cassette sub-family C member 2
Type:Protein
Mol. Mass.:174229.45
Organism:Homo sapiens (Human)
Description:Q92887
Residue:1545
BDBM50202451
NameBDBM50202451
Synonyms:CHEMBL3945493
TypeSmall organic molecule
Emp. Form.C22H21NO4
Mol. Mass.363.4064
SMILESCCCCn1c(\C=C2/Oc3cc(O)cc(O)c3C2=O)c(C)c2ccccc12