Reaction Details
TargetATP-binding cassette sub-family C member 2
LigandBDBM50202453
Substrate/Competitorn/a
Meas. Tech.ChEBML_1624157
IC50 10500±n/a nM
Citation Baiceanu, ENguyen, KAGonzalez-Lobato, LNasr, RBaubichon-Cortay, HLoghin, FLe Borgne, MChow, LBoumendjel, APeuchmaur, MFalson, P 2-Indolylmethylenebenzofuranones as first effective inhibitors of ABCC2. Eur J Med Chem122:408-418 (2016) 
 
ATP-binding cassette sub-family C member 2
Name:ATP-binding cassette sub-family C member 2
Type:Protein
Mol. Mass.:174229.45
Organism:Homo sapiens (Human)
Description:Q92887
Residue:1545
BDBM50202453
NameBDBM50202453
Synonyms:CHEMBL3263906
TypeSmall organic molecule
Emp. Form.C24H23NO4
Mol. Mass.389.4437
SMILESOc1cc2O\C(=C/c3cn(CC4CCCCC4)c4ccccc34)C(=O)c2c(O)c1