Reaction Details
TargetPancreatic alpha-amylase
LigandBDBM50202632
Substrate/Competitorn/a
Meas. Tech.ChEMBL_1624744 (CHEMBL3867156)
IC50 69400±n/a nM
Citation Milella, LMilazzo, SDe Leo, MVera Saltos, MBFaraone, ITuccinardi, TLapillo, MDe Tommasi, NBraca, A a-Glucosidase anda-Amylase Inhibitors from Arcytophyllum thymifolium. J Nat Prod79:2104-12 (2016) 
 
Pancreatic alpha-amylase
Name:Pancreatic alpha-amylase
Type:Protein
Mol. Mass.:57088.07
Organism:Sus scrofa (Pig)
Description:P00690
Residue:511
BDBM50202632
NameBDBM50202632
Synonyms:CHEMBL460030
TypeSmall organic molecule
Emp. Form.C18H24O12
Mol. Mass.432.376
SMILES[H][C@]12[C@@H](O)C=C(COC(C)=O)[C@@]1([H])[C@]([H])(O[C@@H]1O[C@H](CO)[C@@H](O)[C@H](O)[C@H]1O)OC=C2C(O)=O