Reaction Details
TargetPancreatic alpha-amylase
LigandBDBM23410
Substrate/Competitorn/a
Meas. Tech.ChEMBL_1624744 (CHEMBL3867156)
IC50 73900±n/a nM
Citation Milella, LMilazzo, SDe Leo, MVera Saltos, MBFaraone, ITuccinardi, TLapillo, MDe Tommasi, NBraca, A a-Glucosidase anda-Amylase Inhibitors from Arcytophyllum thymifolium. J Nat Prod79:2104-12 (2016) 
 
Pancreatic alpha-amylase
Name:Pancreatic alpha-amylase
Type:Protein
Mol. Mass.:57088.07
Organism:Sus scrofa (Pig)
Description:P00690
Residue:511
BDBM23410
NameBDBM23410
Synonyms:2-(3,4-dihydroxyphenyl)-3,5-dihydroxy-7-methoxy-4H-chromen-4-one Rhamnetin
Typeflavonol
Emp. Form.C16H12O7
Mol. Mass.316.2623
SMILESCOc1cc(O)c2c(c1)oc(-c1ccc(O)c(O)c1)c(O)c2=O