Reaction Details
TargetMitogen-activated protein kinase 1
LigandBDBM50203120
Substrate/Competitorn/a
Meas. Tech.ChEMBL_1624949 (CHEMBL3867361)
IC50 118±n/a nM
Citation Rosse, G Macrocyclic Inhibitors of ERK2 Kinase. ACS Med Chem Lett7:1020-1021 (2016) 
 
Mitogen-activated protein kinase 1
Name:Mitogen-activated protein kinase 1
Type:Ser/Thr Protein Kinase
Mol. Mass.:41392.76
Organism:Homo sapiens (Human)
Description:P28482
Residue:360
BDBM50203120
NameBDBM50203120
Synonyms:CHEMBL3927938
TypeSmall organic molecule
Emp. Form.C20H23N5O3
Mol. Mass.381.4283
SMILESCCn1ncc2cc3NC(=O)N[C@H]([C@H](O)OCCCc(n3)c12)c1ccccc1