Reaction Details
TargetMitogen-activated protein kinase 1
LigandBDBM50203125
Substrate/Competitorn/a
Meas. Tech.ChEMBL_1624949 (CHEMBL3867361)
IC50 3.4±n/a nM
Citation Rosse, G Macrocyclic Inhibitors of ERK2 Kinase. ACS Med Chem Lett7:1020-1021 (2016) 
 
Mitogen-activated protein kinase 1
Name:Mitogen-activated protein kinase 1
Type:Ser/Thr Protein Kinase
Mol. Mass.:41392.76
Organism:Homo sapiens (Human)
Description:P28482
Residue:360
BDBM50203125
NameBDBM50203125
Synonyms:CHEMBL3917936
TypeSmall organic molecule
Emp. Form.C21H25N5O3
Mol. Mass.395.4549
SMILESCCn1ncc2cc3NC(=O)N[C@H]([C@@H](CO)OCCCc(n3)c12)c1ccccc1