Reaction Details
TargetAlpha-1A adrenergic receptor
LigandBDBM50393116
Substrate/Competitorn/a
Meas. Tech.ChEMBL_1625178 (CHEMBL3867647)
Ki 3.5±n/a nM
Citation Silva, ROde Oliveira, ASNunes Lemes, LFde Camargo Nascente, LCoelho do Nascimento Nogueira, PSilveira, ERBrand, GDVistoli, GCilia, APoggesi, EBuccioni, MMarucci, GBolognesi, MLRomeiro, LAS Synthesis and structure-activity relationships of novel arylpiperazines as potent antagonists ofa1-adrenoceptor. Eur J Med Chem122:601-610 (2016) 
 
Alpha-1A adrenergic receptor
Name:Alpha-1A adrenergic receptor
Type:Cell-surface receptors
Mol. Mass.:51511.67
Organism:Homo sapiens (Human)
Description:P35348
Residue:466
BDBM50393116
NameBDBM50393116
Synonyms:CHEMBL2153423
TypeSmall organic molecule
Emp. Form.C20H24N2O3
Mol. Mass.340.4162
SMILESCOc1ccccc1N1CCN(CCc2ccc3OCOc3c2)CC1