Reaction Details
TargetATP-dependent translocase ABCB1
LigandBDBM50075373
Substrate/Competitorn/a
Meas. Tech.ChEMBL_1625353 (CHEMBL3867822)
IC50 9.1±n/a nM
Citation Hsiao, SHLu, YJYang, CCTuo, WCLi, YQHuang, YHHsieh, CHHung, THWu, CP Hernandezine, a Bisbenzylisoquinoline Alkaloid with Selective Inhibitory Activity against Multidrug-Resistance-Linked ATP-Binding Cassette Drug Transporter ABCB1. J Nat Prod79:2135-42 (2016) 
 
ATP-dependent translocase ABCB1
Name:ATP-dependent translocase ABCB1
Type:Protein
Mol. Mass.:141503.50
Organism:Homo sapiens (Human)
Description:P08183
Residue:1280
BDBM50075373
NameBDBM50075373
Synonyms:1N-{4-[2-(6,7-dimethoxy-1,2,3,4-tetrahydro-2-isoquinolinyl)ethyl]phenyl}-4,5-dimethoxy-2-(3-quinolylcarboxamido)benzamide N-(2-((4-(2-(6,7-dimethoxy-3,4-dihydroisoquinolin-2(1H)-yl)ethyl)phenyl)carbamoyl)-4,5-dimethoxyphenyl)quinoline-3-carboxamide US11739089, Compound Tariquidar
TypeSmall organic molecule
Emp. Form.C38H38N4O6
Mol. Mass.646.7315
SMILESCOc1cc2CCN(CCc3ccc(NC(=O)c4cc(OC)c(OC)cc4NC(=O)c4cnc5ccccc5c4)cc3)Cc2cc1OC