Reaction Details
TargetATP-dependent translocase ABCB1
LigandBDBM50201796
Substrate/Competitorn/a
Meas. Tech.ChEMBL_1625413 (CHEMBL3867882)
IC50 970±n/a nM
Citation Hsiao, SHLu, YJYang, CCTuo, WCLi, YQHuang, YHHsieh, CHHung, THWu, CP Hernandezine, a Bisbenzylisoquinoline Alkaloid with Selective Inhibitory Activity against Multidrug-Resistance-Linked ATP-Binding Cassette Drug Transporter ABCB1. J Nat Prod79:2135-42 (2016) 
 
ATP-dependent translocase ABCB1
Name:ATP-dependent translocase ABCB1
Type:Protein
Mol. Mass.:141503.50
Organism:Homo sapiens (Human)
Description:P08183
Residue:1280
BDBM50201796
NameBDBM50201796
Synonyms:CHEBI:5677 | Hernandezine
TypeSmall organic molecule
Emp. Form.C39H44N2O7
Mol. Mass.652.7759
SMILES[H][C@]12Cc3ccc(Oc4cc(C[C@]5([H])N(C)CCc6c(OC)c(OC)c(OC)c(Oc7cc1c(CCN2C)cc7OC)c56)ccc4OC)cc3