Reaction Details
TargetOligo-1,6-glucosidase IMA1
LigandBDBM23406
Substrate/Competitorn/a
Meas. Tech.ChEMBL_1625688 (CHEMBL3868157)
IC50 817380±n/a nM
Citation Wang, GPeng, ZWang, JLi, JLi, X Synthesis and biological evaluation of novel 2,4,5-triarylimidazole-1,2,3-triazole derivatives via click chemistry asa-glucosidase inhibitors. Bioorg Med Chem Lett26:5719-5723 (2016) 
 
Oligo-1,6-glucosidase IMA1
Name:Oligo-1,6-glucosidase IMA1
Type:Protein
Mol. Mass.:68577.59
Organism:Saccharomyces cerevisiae S288c (Baker's yeast)
Description:n/a
Residue:589
BDBM23406
NameBDBM23406
Synonyms:(3R,4R,5S,6R)-5-{[(2R,3R,4R,5S,6R)-5-{[(2R,3R,4S,5S,6R)-3,4-dihydroxy-6-methyl-5-{[(1S,4R,5S,6S)-4,5,6-trihydroxy-3-(hydroxymethyl)cyclohex-2-en-1-yl]amino}oxan-2-yl]oxy}-3,4-dihydroxy-6-(hydroxymethyl)oxan-2-yl]oxy}-6-(hydroxymethyl)oxane-2,3,4-triol US11292789, Acarbose
TypeCarbohydrate
Emp. Form.C25H43NO18
Mol. Mass.645.6048
SMILESC[C@H]1O[C@H](O[C@@H]2[C@@H](CO)O[C@H](O[C@@H]3[C@@H](CO)OC(O)[C@H](O)[C@H]3O)[C@H](O)[C@H]2O)[C@H](O)[C@@H](O)[C@@H]1N[C@H]1C=C(CO)[C@@H](O)[C@H](O)[C@H]1O