Reaction Details
TargetMatrix metalloproteinase-14
LigandBDBM50203954
Substrate/Competitorn/a
Meas. Tech.ChEMBL_1625937 (CHEMBL3868406)
IC50>10000±n/a nM
Citation Nara, HSato, KKaieda, AOki, HKuno, HSantou, TKanzaki, NTerauchi, JUchikawa, OKori, M Design, synthesis, and biological activity of novel, potent, and highly selective fused pyrimidine-2-carboxamide-4-one-based matrix metalloproteinase (MMP)-13 zinc-binding inhibitors. Bioorg Med Chem24:6149-6165 (2016) 
 
Matrix metalloproteinase-14
Name:Matrix metalloproteinase-14
Type:Protein
Mol. Mass.:65900.19
Organism:Homo sapiens (Human)
Description:P50281
Residue:582
BDBM50203954
NameBDBM50203954
Synonyms:CHEMBL3960062
TypeSmall organic molecule
Emp. Form.C25H28N4O7S
Mol. Mass.528.577
SMILESOC(=O)C1CCCCN1S(=O)(=O)CCCOc1cccc(CNC(=O)c2nc3ccccc3c(=O)[nH]2)c1