Reaction Details
TargetNeutrophil collagenase
LigandBDBM50203963
Substrate/Competitorn/a
Meas. Tech.ChEMBL_1625933 (CHEMBL3868402)
IC50<10.0±n/a nM
Citation Nara, HSato, KKaieda, AOki, HKuno, HSantou, TKanzaki, NTerauchi, JUchikawa, OKori, M Design, synthesis, and biological activity of novel, potent, and highly selective fused pyrimidine-2-carboxamide-4-one-based matrix metalloproteinase (MMP)-13 zinc-binding inhibitors. Bioorg Med Chem24:6149-6165 (2016) 
 
Neutrophil collagenase
Name:Neutrophil collagenase
Type:Enzyme
Mol. Mass.:53413.48
Organism:Homo sapiens (Human)
Description:P22894
Residue:467
BDBM50203963
NameBDBM50203963
Synonyms:CHEMBL3907881
TypeSmall organic molecule
Emp. Form.C25H25N7O5
Mol. Mass.503.5099
SMILESO=C(CC1NC(=O)NC1=O)N1CCN(CC1)c1cccc(CNC(=O)c2nc3ccccc3c(=O)[nH]2)c1