Reaction Details
TargetCollagenase 3
LigandBDBM50203956
Substrate/Competitorn/a
Meas. Tech.ChEMBL_1625928 (CHEMBL3868397)
IC50 0.170000±n/a nM
Citation Nara, HSato, KKaieda, AOki, HKuno, HSantou, TKanzaki, NTerauchi, JUchikawa, OKori, M Design, synthesis, and biological activity of novel, potent, and highly selective fused pyrimidine-2-carboxamide-4-one-based matrix metalloproteinase (MMP)-13 zinc-binding inhibitors. Bioorg Med Chem24:6149-6165 (2016) 
 
Collagenase 3
Name:Collagenase 3
Type:Enzyme
Mol. Mass.:53808.06
Organism:Homo sapiens (Human)
Description:P45452
Residue:471
BDBM50203956
NameBDBM50203956
Synonyms:CHEMBL3971135
TypeSmall organic molecule
Emp. Form.C27H26N4O6S
Mol. Mass.534.584
SMILESCC(C)[C@H](NS(=O)(=O)c1ccc(cc1)-c1cccc(CNC(=O)c2nc3ccccc3c(=O)[nH]2)c1)C(O)=O