Reaction Details
TargetNeutrophil collagenase
LigandBDBM50203962
Substrate/Competitorn/a
Meas. Tech.ChEMBL_1625933 (CHEMBL3868402)
IC50 19±n/a nM
Citation Nara, HSato, KKaieda, AOki, HKuno, HSantou, TKanzaki, NTerauchi, JUchikawa, OKori, M Design, synthesis, and biological activity of novel, potent, and highly selective fused pyrimidine-2-carboxamide-4-one-based matrix metalloproteinase (MMP)-13 zinc-binding inhibitors. Bioorg Med Chem24:6149-6165 (2016) 
 
Neutrophil collagenase
Name:Neutrophil collagenase
Type:Enzyme
Mol. Mass.:53413.48
Organism:Homo sapiens (Human)
Description:P22894
Residue:467
BDBM50203962
NameBDBM50203962
Synonyms:CHEMBL3917494
TypeSmall organic molecule
Emp. Form.C28H29N5O6S
Mol. Mass.563.625
SMILESCC(C)C(CS(=O)(=O)c1ccc(cc1)-c1cccc(CNC(=O)c2nc3ccccc3c(=O)[nH]2)c1)N(O)C(N)=O