Reaction Details
TargetStromelysin-1
LigandBDBM50102750
Substrate/Competitorn/a
Meas. Tech.ChEMBL_1625931 (CHEMBL3868400)
IC50 4000±n/a nM
Citation Nara, HSato, KKaieda, AOki, HKuno, HSantou, TKanzaki, NTerauchi, JUchikawa, OKori, M Design, synthesis, and biological activity of novel, potent, and highly selective fused pyrimidine-2-carboxamide-4-one-based matrix metalloproteinase (MMP)-13 zinc-binding inhibitors. Bioorg Med Chem24:6149-6165 (2016) 
 
Stromelysin-1
Name:Stromelysin-1
Type:Enzyme
Mol. Mass.:53973.13
Organism:Homo sapiens (Human)
Description: P08254
Residue:477
BDBM50102750
NameBDBM50102750
Synonyms:CHEMBL3359091
TypeSmall organic molecule
Emp. Form.C26H22FN3O6
Mol. Mass.491.4678
SMILESCOc1cccc(CNC(=O)c2nc3ccc(F)c(OCCc4ccc(cc4)C(O)=O)c3c(=O)[nH]2)c1