Reaction Details
TargetMacrophage metalloelastase
LigandBDBM50203961
Substrate/Competitorn/a
Meas. Tech.ChEMBL_1625936 (CHEMBL3868405)
IC50 1.8±n/a nM
Citation Nara, HSato, KKaieda, AOki, HKuno, HSantou, TKanzaki, NTerauchi, JUchikawa, OKori, M Design, synthesis, and biological activity of novel, potent, and highly selective fused pyrimidine-2-carboxamide-4-one-based matrix metalloproteinase (MMP)-13 zinc-binding inhibitors. Bioorg Med Chem24:6149-6165 (2016) 
 
Macrophage metalloelastase
Name:Macrophage metalloelastase
Type:Enzyme
Mol. Mass.:54012.99
Organism:Homo sapiens (Human)
Description:P39900
Residue:470
BDBM50203961
NameBDBM50203961
Synonyms:CHEMBL3958969
TypeSmall organic molecule
Emp. Form.C25H29N5O7S
Mol. Mass.543.592
SMILESONC(=O)C1CCCCN1S(=O)(=O)CCCOc1cccc(CNC(=O)c2nc3ccccc3c(=O)[nH]2)c1