Reaction Details
TargetStromelysin-2
LigandBDBM50203959
Substrate/Competitorn/a
Meas. Tech.ChEMBL_1625935 (CHEMBL3868404)
IC50 6.2±n/a nM
Citation Nara, HSato, KKaieda, AOki, HKuno, HSantou, TKanzaki, NTerauchi, JUchikawa, OKori, M Design, synthesis, and biological activity of novel, potent, and highly selective fused pyrimidine-2-carboxamide-4-one-based matrix metalloproteinase (MMP)-13 zinc-binding inhibitors. Bioorg Med Chem24:6149-6165 (2016) 
 
Stromelysin-2
Name:Stromelysin-2
Type:Enzyme
Mol. Mass.:54143.02
Organism:Homo sapiens (Human)
Description:P09238
Residue:476
BDBM50203959
NameBDBM50203959
Synonyms:CHEMBL3955430
TypeSmall organic molecule
Emp. Form.C24H24N8O4
Mol. Mass.488.4986
SMILESO=C(Cc1n[nH]c(=O)[nH]1)N1CCN(CC1)c1cccc(CNC(=O)c2nc3ccccc3c(=O)[nH]2)c1