Reaction Details
TargetStromelysin-1
LigandBDBM50203954
Substrate/Competitorn/a
Meas. Tech.ChEMBL_1625931 (CHEMBL3868400)
IC50 370±n/a nM
Citation Nara, HSato, KKaieda, AOki, HKuno, HSantou, TKanzaki, NTerauchi, JUchikawa, OKori, M Design, synthesis, and biological activity of novel, potent, and highly selective fused pyrimidine-2-carboxamide-4-one-based matrix metalloproteinase (MMP)-13 zinc-binding inhibitors. Bioorg Med Chem24:6149-6165 (2016) 
 
Stromelysin-1
Name:Stromelysin-1
Type:Enzyme
Mol. Mass.:53973.13
Organism:Homo sapiens (Human)
Description: P08254
Residue:477
BDBM50203954
NameBDBM50203954
Synonyms:CHEMBL3960062
TypeSmall organic molecule
Emp. Form.C25H28N4O7S
Mol. Mass.528.577
SMILESOC(=O)C1CCCCN1S(=O)(=O)CCCOc1cccc(CNC(=O)c2nc3ccccc3c(=O)[nH]2)c1