Reaction Details
TargetSigma non-opioid intracellular receptor 1
LigandBDBM50204303
Substrate/Competitorn/a
Meas. Tech.ChEMBL_1627277 (CHEMBL3869798)
Ki 126±n/a nM
Citation McLeod, MCAubé, JFrankowski, KJ Decahydrobenzoquinolin-5-one sigma receptor ligands: Divergent development of both sigma 1 and sigma 2 receptor selective examples. Bioorg Med Chem Lett26:5689-5694 (2016) 
 
Sigma non-opioid intracellular receptor 1
Name:Sigma non-opioid intracellular receptor 1
Type:Protein
Mol. Mass.:25307.17
Organism:Cavia porcellus (Guinea pig)
Description:Q60492
Residue:223
BDBM50204303
NameBDBM50204303
Synonyms:CHEMBL3935644
TypeSmall organic molecule
Emp. Form.C15H25NO
Mol. Mass.235.3651
SMILES[H][C@@]12CCC[C@@]3([H])N(CCC)CC[C@@]([H])(CC(=O)C1)[C@]23[H]