Reaction Details
TargetMu-type opioid receptor
LigandBDBM50204324
Substrate/Competitorn/a
Meas. Tech.ChEMBL_1627275 (CHEMBL3869796)
Ki>10000±n/a nM
Citation McLeod, MCAubé, JFrankowski, KJ Decahydrobenzoquinolin-5-one sigma receptor ligands: Divergent development of both sigma 1 and sigma 2 receptor selective examples. Bioorg Med Chem Lett26:5689-5694 (2016) 
 
Mu-type opioid receptor
Name:Mu-type opioid receptor
Type:G Protein-Coupled Receptor (GPCR)
Mol. Mass.:44789.51
Organism:Homo sapiens (Human)
Description:P35372
Residue:400
BDBM50204324
NameBDBM50204324
Synonyms:CHEMBL3952259
TypeSmall organic molecule
Emp. Form.C22H28N2
Mol. Mass.320.4711
SMILES[H][C@@]12CCC[C@@]3([H])N(C)CC[C@@]([H])(c4cc5ccccc5nc4[C@@H]1CC)[C@]23[H]