Reaction Details
TargetKappa-type opioid receptor
LigandBDBM50204312
Substrate/Competitorn/a
Meas. Tech.ChEMBL_1627276 (CHEMBL3869797)
Ki>10000±n/a nM
Citation McLeod, MCAubé, JFrankowski, KJ Decahydrobenzoquinolin-5-one sigma receptor ligands: Divergent development of both sigma 1 and sigma 2 receptor selective examples. Bioorg Med Chem Lett26:5689-5694 (2016) 
 
Kappa-type opioid receptor
Name:Kappa-type opioid receptor
Type:G Protein-Coupled Receptor (GPCR)
Mol. Mass.:42648.76
Organism:Homo sapiens (Human)
Description:P41145
Residue:380
BDBM50204312
NameBDBM50204312
Synonyms:CHEMBL3936289
TypeSmall organic molecule
Emp. Form.C20H27NO
Mol. Mass.297.4345
SMILES[H][C@]12CCN(C)[C@]3([H])CCC[C@]([H])([C@@H](Cc4ccccc4)C(=O)C1)[C@@]23[H]