Reaction Details
TargetDelta-type opioid receptor
LigandBDBM50204300
Substrate/Competitorn/a
Meas. Tech.ChEMBL_1627274 (CHEMBL3869795)
Ki>10000±n/a nM
Citation McLeod, MCAubé, JFrankowski, KJ Decahydrobenzoquinolin-5-one sigma receptor ligands: Divergent development of both sigma 1 and sigma 2 receptor selective examples. Bioorg Med Chem Lett26:5689-5694 (2016) 
 
Delta-type opioid receptor
Name:Delta-type opioid receptor
Type:G Protein-Coupled Receptor (GPCR)
Mol. Mass.:40382.98
Organism:Homo sapiens (Human)
Description:Competition binding assays were carried out using membrane preparations from transfected HN9.10 cells that constitutively expressed the delta opioid receptor.
Residue:372
BDBM50204300
NameBDBM50204300
Synonyms:CHEMBL3910552
TypeSmall organic molecule
Emp. Form.C23H28N2OS
Mol. Mass.380.546
SMILES[H][C@]12CCN(Cc3nccs3)[C@]3([H])CCC[C@]([H])([C@@H](Cc4ccccc4)C(=O)C1)[C@@]23[H]