Reaction Details
TargetAlpha-1D adrenergic receptor
LigandBDBM50204312
Substrate/Competitorn/a
Meas. Tech.ChEMBL_1627293 (CHEMBL3869814)
Ki>10000±n/a nM
Citation McLeod, MCAubé, JFrankowski, KJ Decahydrobenzoquinolin-5-one sigma receptor ligands: Divergent development of both sigma 1 and sigma 2 receptor selective examples. Bioorg Med Chem Lett26:5689-5694 (2016) 
 
Alpha-1D adrenergic receptor
Name:Alpha-1D adrenergic receptor
Type:Enzyme Catalytic Domain
Mol. Mass.:60485.82
Organism:Homo sapiens (Human)
Description:adrenergic Alpha1D ADRA1D HUMAN::P25100
Residue:572
BDBM50204312
NameBDBM50204312
Synonyms:CHEMBL3936289
TypeSmall organic molecule
Emp. Form.C20H27NO
Mol. Mass.297.4345
SMILES[H][C@]12CCN(C)[C@]3([H])CCC[C@]([H])([C@@H](Cc4ccccc4)C(=O)C1)[C@@]23[H]