Reaction Details
TargetCholinesterase
LigandBDBM50204495
Substrate/Competitorn/a
Meas. Tech.ChEMBL_1627477 (CHEMBL3869998)
Ki 160±n/a nM
Citation Wang, LWang, YTian, YShang, JSun, XChen, HWang, HTan, W Design, synthesis, biological evaluation, and molecular modeling studies of chalcone-rivastigmine hybrids as cholinesterase inhibitors. Bioorg Med Chem25:360-371 (2017) 
 
Cholinesterase
Name:Cholinesterase
Type:Homotetramer
Mol. Mass.:68422.27
Organism:Homo sapiens (Human)
Description:P06276
Residue:602
BDBM50204495
NameBDBM50204495
Synonyms:CHEMBL3921061
TypeSmall organic molecule
Emp. Form.C18H17NO4
Mol. Mass.311.3319
SMILESCN(C)C(=O)Oc1cccc(c1)C(=O)\C=C\c1ccc(O)cc1