Reaction Details
TargetPhosphodiesterase
LigandBDBM50204595
Substrate/Competitorn/a
Meas. Tech.ChEMBL_1627692 (CHEMBL3870213)
Ki 0.800000±n/a nM
Citation Abdel-Magid, AF Potential Treatment of Cognitive Impairment in Schizophrenia by Phosphodiesterase 2 (PDE2) Inhibitors. ACS Med Chem Lett8:17-18 (2017) 
 
Phosphodiesterase
Name:Phosphodiesterase
Type:Enzyme Catalytic Domain
Mol. Mass.:105547.91
Organism:Macaca mulatta (Rhesus macaque)
Description:n/a
Residue:941
BDBM50204595
NameBDBM50204595
Synonyms:CHEMBL3889667 | US10285989, Example 94
TypeSmall organic molecule
Emp. Form.C17H16F4N4O2
Mol. Mass.384.3282
SMILESCN(C)c1nc(cc(=O)[nH]1)C(=O)NC1(CC1)c1ccc(c(F)c1)C(F)(F)F