Reaction Details
TargetPhosphodiesterase
LigandBDBM50204597
Substrate/Competitorn/a
Meas. Tech.ChEMBL_1627692 (CHEMBL3870213)
Ki 0.820000±n/a nM
Citation Abdel-Magid, AF Potential Treatment of Cognitive Impairment in Schizophrenia by Phosphodiesterase 2 (PDE2) Inhibitors. ACS Med Chem Lett8:17-18 (2017) 
 
Phosphodiesterase
Name:Phosphodiesterase
Type:Enzyme Catalytic Domain
Mol. Mass.:105547.91
Organism:Macaca mulatta (Rhesus macaque)
Description:n/a
Residue:941
BDBM50204597
NameBDBM50204597
Synonyms:CHEMBL3906832
TypeSmall organic molecule
Emp. Form.C16H16ClF3N4O3
Mol. Mass.404.771
SMILESC[C@@H](NC(=O)c1cc(=O)[nH]c(n1)N(C)C)c1ccc(OC(F)(F)F)c(Cl)c1