Reaction Details
TargetProtein-arginine deiminase type-4
LigandBDBM50204600
Substrate/Competitorn/a
Meas. Tech.ChEMBL_1627702 (CHEMBL3870223)
IC50 158±n/a nM
Citation Abdel-Magid, AF Great Therapeutic Potential of Peptidylarginine Deiminase 4 (PAD4) Inhibitors: Treatment of Rheumatoid Arthritis, Epigenetic Tools, Regulation of Pluripotency in Stem Cells, and More. ACS Med Chem Lett8:19-21 (2017) 
 
Protein-arginine deiminase type-4
Name:Protein-arginine deiminase type-4
Type:Enzyme Catalytic Domain
Mol. Mass.:74078.90
Organism:Homo sapiens (Human)
Description:gi_216548487
Residue:663
BDBM50204600
NameBDBM50204600
Synonyms:CHEMBL3952821
TypeSmall organic molecule
Emp. Form.C24H24F3N5O
Mol. Mass.455.4755
SMILESCn1c(nc2cc(ccc12)C(=O)N1CCC[C@@H](N)C1)-c1cc2ccccc2n1CC(F)(F)F