Reaction Details
TargetProtein-arginine deiminase type-2
LigandBDBM50204603
Substrate/Competitorn/a
Meas. Tech.ChEMBL_1627703 (CHEMBL3870224)
IC50<79433±n/a nM
Citation Abdel-Magid, AF Great Therapeutic Potential of Peptidylarginine Deiminase 4 (PAD4) Inhibitors: Treatment of Rheumatoid Arthritis, Epigenetic Tools, Regulation of Pluripotency in Stem Cells, and More. ACS Med Chem Lett8:19-21 (2017) 
 
Protein-arginine deiminase type-2
Name:Protein-arginine deiminase type-2
Type:PROTEIN
Mol. Mass.:75552.49
Organism:Homo sapiens (Human)
Description:ChEMBL_1290379
Residue:665
BDBM50204603
NameBDBM50204603
Synonyms:CHEMBL3907951
TypeSmall organic molecule
Emp. Form.C25H26F3N5O2
Mol. Mass.485.5014
SMILESCOc1cc(cc2nc(-c3cc4ccccc4n3CC(F)(F)F)n(C)c12)C(=O)N1CCC[C@@H](N)C1