Reaction Details
TargetEpidermal growth factor receptor
LigandBDBM50204620
Substrate/Competitorn/a
Meas. Tech.ChEBML_1627833
IC50>1000±n/a nM
Citation Wang, YZhang, GHu, GBu, YLei, HZuo, DHan, MZhai, XGong, P Design, synthesis and biological evaluation of novel 4-arylaminopyrimidine derivatives possessing a hydrazone moiety as dual inhibitors of L1196M ALK and ROS1. Eur J Med Chem123:80-89 (2016) 
 
Epidermal growth factor receptor
Name:Epidermal growth factor receptor
Type:Receptor Kinase Domain
Mol. Mass.:134279.59
Organism:Homo sapiens (Human)
Description:P00533
Residue:1210
BDBM50204620
NameBDBM50204620
Synonyms:CHEMBL3950479
TypeSmall organic molecule
Emp. Form.C22H24ClN5O3S
Mol. Mass.473.976
SMILESCOc1ccc(cc1)C(\C)=N\Nc1ncc(Cl)c(Nc2ccccc2S(=O)(=O)C(C)C)n1