Reaction Details
TargetEpidermal growth factor receptor
LigandBDBM50204619
Substrate/Competitorn/a
Meas. Tech.ChEMBL_1627833 (CHEMBL3870418)
IC50 593±n/a nM
Citation Wang, YZhang, GHu, GBu, YLei, HZuo, DHan, MZhai, XGong, P Design, synthesis and biological evaluation of novel 4-arylaminopyrimidine derivatives possessing a hydrazone moiety as dual inhibitors of L1196M ALK and ROS1. Eur J Med Chem123:80-89 (2016) 
 
Epidermal growth factor receptor
Name:Epidermal growth factor receptor
Type:Receptor Kinase Domain
Mol. Mass.:134279.59
Organism:Homo sapiens (Human)
Description:P00533
Residue:1210
BDBM50204619
NameBDBM50204619
Synonyms:CHEMBL3893810
TypeSmall organic molecule
Emp. Form.C21H19ClF3N5O2S
Mol. Mass.497.921
SMILESCC(C)S(=O)(=O)c1ccccc1Nc1nc(N\N=C\c2ccc(cc2)C(F)(F)F)ncc1Cl