Reaction Details
TargetHepatocyte growth factor receptor
LigandBDBM50204639
Substrate/Competitorn/a
Meas. Tech.ChEMBL_1627832 (CHEMBL3870417)
IC50 157±n/a nM
Citation Wang, YZhang, GHu, GBu, YLei, HZuo, DHan, MZhai, XGong, P Design, synthesis and biological evaluation of novel 4-arylaminopyrimidine derivatives possessing a hydrazone moiety as dual inhibitors of L1196M ALK and ROS1. Eur J Med Chem123:80-89 (2016) 
 
Hepatocyte growth factor receptor
Name:Hepatocyte growth factor receptor
Type:Protein
Mol. Mass.:155559.73
Organism:Homo sapiens (Human)
Description:P08581
Residue:1390
BDBM50204639
NameBDBM50204639
Synonyms:CHEMBL3894726
TypeSmall organic molecule
Emp. Form.C21H22ClN5O3S
Mol. Mass.459.949
SMILESCOc1ccc(\C=N\Nc2ncc(Cl)c(Nc3ccccc3S(=O)(=O)C(C)C)n2)cc1