Reaction Details
TargetDual specificity protein kinase CLK1
LigandBDBM50204659
Substrate/Competitorn/a
Meas. Tech.ChEMBL_1627842 (CHEMBL3870427)
IC50 1700±n/a nM
Citation Lawson, MRodrigo, JBaratte, BRobert, TDelehouzé, CLozach, ORuchaud, SBach, SBrion, JDAlami, MHamze, A Synthesis, biological evaluation and molecular modeling studies of imidazo[1,2-a]pyridines derivatives as protein kinase inhibitors. Eur J Med Chem123:105-114 (2016) 
 
Dual specificity protein kinase CLK1
Name:Dual specificity protein kinase CLK1
Type:Protein
Mol. Mass.:57322.21
Organism:Homo sapiens (Human)
Description:P49759
Residue:484
BDBM50204659
NameBDBM50204659
Synonyms:CHEMBL3923825
TypeSmall organic molecule
Emp. Form.C13H10N4O2
Mol. Mass.254.2441
SMILESNC(=O)c1cc(ccc1O)-c1cn2ccncc2n1