Reaction Details
TargetCasein kinase I delta/epsilon
LigandBDBM50204658
Substrate/Competitorn/a
Meas. Tech.ChEMBL_1627839 (CHEMBL3870424)
IC50>10000±n/a nM
Citation Lawson, MRodrigo, JBaratte, BRobert, TDelehouz, CLozach, ORuchaud, SBach, SBrion, JDAlami, MHamze, A Synthesis, biological evaluation and molecular modeling studies of imidazo[1,2-a]pyridines derivatives as protein kinase inhibitors. Eur J Med Chem123:105-114 (2016) 
 
Casein kinase I delta/epsilon
Name:Casein kinase I delta/epsilon
Synonyms:Casein kinase I isoform delta/epsilon
Type:n/a
Mol. Mass.:n/a
Description:ASSAY_ID of ChEMBL is 2149257
Components:This complex has 2 components.
Component 1
Name:Casein kinase I isoform delta
Type:Enzyme
Mol. Mass.:47356.76
Organism:Homo sapiens (Human)
Description:P48730
Residue:415
Component 2
Name:Casein kinase I isoform epsilon
Synonyms:Axin-1/Casein kinase I epsilon CKIe Casein kinase 1 epsilon (CK1Ɛ) Casein kinase I isoform epsilon (CK1 epsilon) Casein kinase I isoform epsilon (CK1epsilon) | KC1E_HUMAN
Type:Protein
Mol. Mass.:47340.25
Organism:Homo sapiens (Human)
Description:P49674
Residue:416
BDBM50204658
NameBDBM50204658
Synonyms:CHEMBL3908596
TypeSmall organic molecule
Emp. Form.C14H10BrN3O2
Mol. Mass.332.152
SMILESNC(=O)c1cc(ccc1O)-c1cn2cc(Br)ccc2n1