Reaction Details
TargetGlycogen synthase kinase-3
LigandBDBM50204646
Substrate/Competitorn/a
Meas. Tech.ChEMBL_1627840 (CHEMBL3870425)
IC50>10000±n/a nM
Citation Lawson, MRodrigo, JBaratte, BRobert, TDelehouzé, CLozach, ORuchaud, SBach, SBrion, JDAlami, MHamze, A Synthesis, biological evaluation and molecular modeling studies of imidazo[1,2-a]pyridines derivatives as protein kinase inhibitors. Eur J Med Chem123:105-114 (2016) 
 
Glycogen synthase kinase-3
Name:Glycogen synthase kinase-3
Synonyms:Glycogen synthase kinase-3 alpha/beta
Type:n/a
Mol. Mass.:n/a
Description:ASSAY_ID of ChEMBL is 2193535
Components:This complex has 2 components.
Component 1
Name:Glycogen synthase kinase-3 alpha
Type:Enzyme
Mol. Mass.:50991.79
Organism:Homo sapiens (Human)
Description:P49840
Residue:483
Component 2
Name:Glycogen synthase kinase-3 beta
Synonyms:GSK-3 beta GSK3B Glycogen synthase kinase 3 beta (GSK3B) Glycogen synthase kinase-3 beta (GSK-3B) Glycogen synthase kinase-3 beta (GSK3B) Glycogen synthase kinase-3beta (GSK3B) | Serine/threonine-protein kinase GSK3B
Type:Enzyme
Mol. Mass.:46756.38
Organism:Homo sapiens (Human)
Description:P49841
Residue:420
BDBM50204646
NameBDBM50204646
Synonyms:CHEMBL3962894
TypeSmall organic molecule
Emp. Form.C14H11N3O3
Mol. Mass.269.2554
SMILESNC(=O)c1cc(ccc1O)-c1cn2cc(O)ccc2n1