Reaction Details
TargetAlpha-mannosidase
LigandBDBM18351
Substrate/Competitorn/a
Meas. Tech.ChEMBL_1627881 (CHEMBL3870466)
Ki 270000±n/a nM
Citation Olsen, JIPlata, GBPadrón, JMLópez, ÓBols, MFernández-Bolaños, JG Selenoureido-iminosugars: A new family of multitarget drugs. Eur J Med Chem123:155-160 (2016) 
 
Alpha-mannosidase
Name:Alpha-mannosidase
Type:PROTEIN
Mol. Mass.:108565.93
Organism:Canavalia ensiformis
Description:ChEMBL_109557
Residue:959
BDBM18351
NameBDBM18351
Synonyms:(2R,3R,4R,5S)-2-(Hydroxymethyl)piperidine-3,4,5-triol, 10 1-Deoxynojirimycin CHEMBL307429 US9181184, 1 | dNM
Typenatural product
Emp. Form.C6H13NO4
Mol. Mass.163.1717
SMILESOC[C@H]1NC[C@H](O)[C@@H](O)[C@@H]1O