Reaction Details
TargetVascular endothelial growth factor receptor 2
LigandBDBM50205140
Substrate/Competitorn/a
Meas. Tech.ChEMBL_1628034 (CHEMBL3870619)
IC50 480±n/a nM
Citation Liu, JNie, MWang, YHu, JZhang, FGao, YLiu, YGong, P Design, synthesis and structure-activity relationships of novel 4-phenoxyquinoline derivatives containing 1,2,4-triazolone moiety as c-Met kinase inhibitors. Eur J Med Chem123:431-446 (2016) 
 
Vascular endothelial growth factor receptor 2
Name:Vascular endothelial growth factor receptor 2
Type:Receptor Tyrosine Kinase
Mol. Mass.:151510.97
Organism:Homo sapiens (Human)
Description:P35968
Residue:1356
BDBM50205140
NameBDBM50205140
Synonyms:CHEMBL3946811
TypeSmall organic molecule
Emp. Form.C34H35F2N7O5
Mol. Mass.659.6824
SMILESCOc1cc2c(Oc3ccc(NC(=O)c4nn(-c5ccccc5F)c(=O)n4C)cc3F)ccnc2cc1OCCCN1CCN(C)CC1