Reaction Details
TargetCarbonic anhydrase 2
LigandBDBM50205563
Substrate/Competitorn/a
Meas. Tech.ChEMBL_1628395 (CHEMBL3870980)
Ki 6809±n/a nM
Citation Esirden, ITanç, MSupuran, CTKaya, M Microwave assisted synthesis of novel tetrazole/sulfonamide derivatives based on octahydroacridine, xanthene and chromene skeletons as inhibitors of the carbonic anhydrases isoforms I, II, IV and VII. Bioorg Med Chem Lett27:86-89 (2017) 
 
Carbonic anhydrase 2
Name:Carbonic anhydrase 2
Type:Enzyme
Mol. Mass.:29250.71
Organism:Homo sapiens (Human)
Description:P00918
Residue:260
BDBM50205563
NameBDBM50205563
Synonyms:CHEMBL3969810
TypeSmall organic molecule
Emp. Form.C30H32N6O4S
Mol. Mass.572.678
SMILESCC1(C)CC(=O)C2=C(C1)N(C1=C(C2c2ccc(cc2)-c2nnn[nH]2)C(=O)CC(C)(C)C1)c1ccc(cc1)S(N)(=O)=O