Reaction Details
TargetCarbonic anhydrase 2
LigandBDBM50205565
Substrate/Competitorn/a
Meas. Tech.ChEMBL_1628395 (CHEMBL3870980)
Ki>10000±n/a nM
Citation Esirden, ITanç, MSupuran, CTKaya, M Microwave assisted synthesis of novel tetrazole/sulfonamide derivatives based on octahydroacridine, xanthene and chromene skeletons as inhibitors of the carbonic anhydrases isoforms I, II, IV and VII. Bioorg Med Chem Lett27:86-89 (2017) 
 
Carbonic anhydrase 2
Name:Carbonic anhydrase 2
Type:Enzyme
Mol. Mass.:29250.71
Organism:Homo sapiens (Human)
Description:P00918
Residue:260
BDBM50205565
NameBDBM50205565
Synonyms:CHEMBL3890627
TypeSmall organic molecule
Emp. Form.C24H26N4O3
Mol. Mass.418.4882
SMILESCC1(C)CC(=O)C2=C(C1)OC1=C(C2c2ccc(cc2)-c2nnn[nH]2)C(=O)CC(C)(C)C1