Reaction Details
TargetCarbonic anhydrase 2
LigandBDBM50205569
Substrate/Competitorn/a
Meas. Tech.ChEMBL_1628395 (CHEMBL3870980)
Ki 883±n/a nM
Citation Esirden, ITanç, MSupuran, CTKaya, M Microwave assisted synthesis of novel tetrazole/sulfonamide derivatives based on octahydroacridine, xanthene and chromene skeletons as inhibitors of the carbonic anhydrases isoforms I, II, IV and VII. Bioorg Med Chem Lett27:86-89 (2017) 
 
Carbonic anhydrase 2
Name:Carbonic anhydrase 2
Type:Enzyme
Mol. Mass.:29250.71
Organism:Homo sapiens (Human)
Description:P00918
Residue:260
BDBM50205569
NameBDBM50205569
Synonyms:CHEMBL3928382
TypeSmall organic molecule
Emp. Form.C26H24N6O4S
Mol. Mass.516.572
SMILESNS(=O)(=O)c1ccc(cc1)N1C2=C(C(C3=C1CCCC3=O)c1ccc(cc1)-c1nnn[nH]1)C(=O)CCC2