Reaction Details
TargetCarbonic anhydrase 2
LigandBDBM50205574
Substrate/Competitorn/a
Meas. Tech.ChEMBL_1628395 (CHEMBL3870980)
Ki>10000±n/a nM
Citation Esirden, ITanç, MSupuran, CTKaya, M Microwave assisted synthesis of novel tetrazole/sulfonamide derivatives based on octahydroacridine, xanthene and chromene skeletons as inhibitors of the carbonic anhydrases isoforms I, II, IV and VII. Bioorg Med Chem Lett27:86-89 (2017) 
 
Carbonic anhydrase 2
Name:Carbonic anhydrase 2
Type:Enzyme
Mol. Mass.:29250.71
Organism:Homo sapiens (Human)
Description:P00918
Residue:260
BDBM50205574
NameBDBM50205574
Synonyms:CHEMBL3950179
TypeSmall organic molecule
Emp. Form.C20H18N4O3
Mol. Mass.362.3819
SMILESO=C1CCCC2=C1C(C1=C(CCCC1=O)O2)c1ccc(cc1)-c1nnn[nH]1