Reaction Details
TargetCarbonic anhydrase 7
LigandBDBM50205598
Substrate/Competitorn/a
Meas. Tech.ChEMBL_1628397 (CHEMBL3870982)
Ki>10000±n/a nM
Citation Esirden, ITanç, MSupuran, CTKaya, M Microwave assisted synthesis of novel tetrazole/sulfonamide derivatives based on octahydroacridine, xanthene and chromene skeletons as inhibitors of the carbonic anhydrases isoforms I, II, IV and VII. Bioorg Med Chem Lett27:86-89 (2017) 
 
Carbonic anhydrase 7
Name:Carbonic anhydrase 7
Type:Enzyme
Mol. Mass.:29664.11
Organism:Homo sapiens (Human)
Description:Human cloned isozyme.
Residue:264
BDBM50205598
NameBDBM50205598
Synonyms:CHEMBL3959700
TypeSmall organic molecule
Emp. Form.C24H26N4O3
Mol. Mass.418.4882
SMILESCC1(C)CC(=O)C2=C(C1)OC1=C(C2c2cccc(c2)-c2nnn[nH]2)C(=O)CC(C)(C)C1